Target
Steryl-sulfatase
Ligand
BDBM50307893
Substrate
Meas. Tech.
ChEMBL_612870 (CHEMBL1067559)
IC50
160±n/a nM
Citation
 Woo, LWJackson, TPutey, ACozier, GLeonard, PAcharya, KRChander, SKPurohit, AReed, MJPotter, BV Highly potent first examples of dual aromatase-steroid sulfatase inhibitors based on a biphenyl template. J Med Chem 53:2155-70 (2010)  
Target
Name:
Steryl-sulfatase
Synonyms:
ARSC1 Arylsulfatase C STS_HUMAN Steryl-sulfate sulfohydrolase
Type:
Enzyme
Mol. Mass.:
65503.66
Organism:
Homo sapiens (Human)
Description:
P08842
Residue:
583
  
Inhibitor
Name:
BDBM50307893
Synonyms:
3'-((1H-1,2,4-triazol-1-yl)methyl)-3-chlorobiphenyl-4-yl sulfamate | CHEMBL598009
Type:
Small organic molecule
Emp. Form.:
C15H13ClN4O3S
Mol. Mass.:
364.807
SMILES:
NS(=O)(=O)Oc1ccc(cc1Cl)-c1cccc(Cn2cncn2)c1
: