Target
Aromatase
Ligand
BDBM13058
Substrate
Meas. Tech.
ChEMBL_612867 (CHEMBL1067556)
IC50
300±n/a nM
Citation
 Woo, LWJackson, TPutey, ACozier, GLeonard, PAcharya, KRChander, SKPurohit, AReed, MJPotter, BV Highly potent first examples of dual aromatase-steroid sulfatase inhibitors based on a biphenyl template. J Med Chem 53:2155-70 (2010)  
Target
Name:
Aromatase
Synonyms:
ARO1 CP19A_HUMAN CYP19 CYPXIX Cytochrome P450 19A1 Cytochrome P450-C19 (CYP19) FL cytokine receptor precursor | P-450AROM
Type:
Enzyme
Mol. Mass.:
57888.92
Organism:
Homo sapiens (Human)
Description:
P11511
Residue:
503
  
Inhibitor
Name:
BDBM13058
Synonyms:
6-oxo-6,7,8,9,10,11-hexahydrocyclohepta[c]chromen-3-yl sulfamate 667COUMATE CHEMBL286738 STX64 | {9-oxo-8-oxatricyclo[8.5.0.0^{2,7}]pentadeca-1(10),2(7),3,5-tetraen-5-yl} sulfamate
Type:
Small organic molecule
Emp. Form.:
C14H15NO5S
Mol. Mass.:
309.338
SMILES:
NS(=O)(=O)Oc1ccc2c3CCCCCc3c(=O)oc2c1
: