Target
Progesterone receptor
Ligand
BDBM50292750
Substrate
Meas. Tech.
ChEMBL_612908 (CHEMBL1069507)
IC50
0.17±n/a nM
Citation
 Saha, PHödl, CStrauss, WSSteiner, RGoessler, WKunert, OLeitner, AHaslinger, ESchramm, HW Synthesis, in vitro progesterone receptors affinity of gadolinium containing mifepristone conjugates and estimation of binding sites in human breast cancer cells. Bioorg Med Chem 18:1891-8 (2010)  
Target
Name:
Progesterone receptor
Synonyms:
NR3C3 PGR PRGR_HUMAN | progesterone
Type:
Protein
Mol. Mass.:
98979.52
Organism:
Homo sapiens (Human)
Description:
P06401
Residue:
933
  
Inhibitor
Name:
BDBM50292750
Synonyms:
17beta-Hydroxy-11beta-[4-(methylamino)-phenyl]-17alpha-(1-propinyl)-estra-4,9-dien-3-one CHEMBL1608
Type:
Small organic molecule
Emp. Form.:
C28H33NO2
Mol. Mass.:
415.5671
SMILES:
CNc1ccc(cc1)[C@H]1C[C@@]2(C)[C@@H](CC[C@@]2(O)C#CC)[C@@H]2CCC3=CC(=O)CCC3=C12
: