Target
Botulinum neurotoxin type A
Ligand
BDBM50308031
Substrate
Meas. Tech.
ChEMBL_609720 (CHEMBL1067457)
Ki
760±n/a nM
Citation
 Li, BPai, RCardinale, SCButler, MMPeet, NPMoir, DTBavari, SBowlin, TL Synthesis and biological evaluation of botulinum neurotoxin a protease inhibitors. J Med Chem 53:2264-76 (2010)  
Target
Name:
Botulinum neurotoxin type A
Synonyms:
BXA1_CLOBO bonT | botA
Type:
PROTEIN
Mol. Mass.:
149450.01
Organism:
Clostridium botulinum
Description:
ChEMBL_1510137
Residue:
1296
  
Inhibitor
Name:
BDBM50308031
Synonyms:
CHEMBL591192 | N-(7-(7-aminoheptylamino)heptyl)-5-(3-hydroxy-3,3-diphenylpropyl)-4-(3-(hydroxyamino)-3-oxopropyl)-1H-pyrrole-2-carboxamide
Type:
Small organic molecule
Emp. Form.:
C37H55N5O4
Mol. Mass.:
633.8637
SMILES:
NCCCCCCCNCCCCCCCNC(=O)c1cc(CCC(=O)NO)c(CCC(O)(c2ccccc2)c2ccccc2)[nH]1
: