Target
Serine/threonine-protein kinase mTOR
Ligand
BDBM50308148
Substrate
Meas. Tech.
ChEMBL_611077 (CHEMBL1065057)
IC50
1.8±n/a nM
Citation
 Venkatesan, AMDehnhardt, CMDelos Santos, EChen, ZDos Santos, OAyral-Kaloustian, SKhafizova, GBrooijmans, NMallon, RHollander, IFeldberg, LLucas, JYu, KGibbons, JAbraham, RTChaudhary, IMansour, TS Bis(morpholino-1,3,5-triazine) derivatives: potent adenosine 5'-triphosphate competitive phosphatidylinositol-3-kinase/mammalian target of rapamycin inhibitors: discovery of compound 26 (PKI-587), a highly efficacious dual inhibitor. J Med Chem 53:2636-45 (2010)  
Target
Name:
Serine/threonine-protein kinase mTOR
Synonyms:
FK506-binding protein 12-rapamycin complex-associated protein 1 FRAP FRAP1 MTOR Mammalian Target of Rapamycin (mTOR) RAFT1 Rapamycin and FKBP12 target 1 Serine/threonine-protein kinase (mTOR) | mTORC2
Type:
Rapamycin target protein
Mol. Mass.:
288917.12
Organism:
Homo sapiens (Human)
Description:
P42345
Residue:
2549
  
Inhibitor
Name:
BDBM50308148
Synonyms:
1-[4-(4,6-Dimorpholin-4-yl-1,3,5-triazin-2-yl)-phenyl]-3-[4-(1-hydroxyethyl)phenyl]urea | CHEMBL605121
Type:
Small organic molecule
Emp. Form.:
C26H31N7O4
Mol. Mass.:
505.5688
SMILES:
OCCc1ccc(NC(=O)Nc2ccc(cc2)-c2nc(nc(n2)N2CCOCC2)N2CCOCC2)cc1
: