Target
Alpha-glucosidase MAL12
Ligand
BDBM50308257
Substrate
Meas. Tech.
ChEMBL_613790 (CHEMBL1069561)
IC50
15100±n/a nM
Citation
 Ferreira, SBSodero, ACCardoso, MFLima, ESKaiser, CRSilva, FPFerreira, VF Synthesis, biological activity, and molecular modeling studies of 1H-1,2,3-triazole derivatives of carbohydrates as alpha-glucosidases inhibitors. J Med Chem 53:2364-75 (2010)  
Target
Name:
Alpha-glucosidase MAL12
Synonyms:
α-Glucosidase MAL12_YEAST Maltase | alpha-Glucosidase (α-Glucosidase)
Type:
Protein
Mol. Mass.:
68084.32
Organism:
Saccharomyces cerevisiae
Description:
P53341
Residue:
584
  
Inhibitor
Name:
BDBM50308257
Synonyms:
1-O-Methyl-2,3-O-isopropylidene-5-(4-carboxylate ethyl-1H-1,2,3-triazol-1-yl)-beta-D-ribofuranose | CHEMBL603160
Type:
Small organic molecule
Emp. Form.:
C14H21N3O6
Mol. Mass.:
327.333
SMILES:
CCOC(=O)c1cn(C[C@H]2O[C@@H](OC)[C@@H]3OC(C)(C)O[C@H]23)nn1
: