Target
Sodium/glucose cotransporter 2
Ligand
BDBM50308436
Substrate
Meas. Tech.
ChEMBL_613982 (CHEMBL1069022)
IC50
10.9±n/a nM
Citation
 Lee, JLee, SHSeo, HJSon, EJLee, SHJung, MELee, MHan, HKKim, JKang, JLee, J Novel C-aryl glucoside SGLT2 inhibitors as potential antidiabetic agents: 1,3,4-Thiadiazolylmethylphenyl glucoside congeners. Bioorg Med Chem 18:2178-94 (2010)  
Target
Name:
Sodium/glucose cotransporter 2
Synonyms:
Na(+)/glucose cotransporter 2 SGLT2 Sodium-Dependent Glucose Cotransporter 2 (SGLT2) Solute carrier family 5 member 2
Type:
Protein
Mol. Mass.:
72902.00
Organism:
Homo sapiens (Human)
Description:
P31639
Residue:
672
  
Inhibitor
Name:
BDBM50308436
Synonyms:
(2S,3R,4R,5S,6R)-2-(4-Chloro-3-((5-(methylthio)-1,3,4-thiadiazol-2-yl)methyl)phenyl)-6-(hydroxymethyl)-tetrahydro-2H-pyran-3,4,5-triol US8541380, 40
Type:
Small organic molecule
Emp. Form.:
C16H19ClN2O5S2
Mol. Mass.:
418.915
SMILES:
CSc1nnc(Cc2cc(ccc2Cl)[C@@H]2O[C@H](CO)[C@@H](O)[C@H](O)[C@H]2O)s1
: