Target
Sodium/glucose cotransporter 2
Ligand
BDBM20878
Substrate
Meas. Tech.
ChEMBL_613982 (CHEMBL1069022)
IC50
6.25±n/a nM
Citation
 Lee, JLee, SHSeo, HJSon, EJLee, SHJung, MELee, MHan, HKKim, JKang, JLee, J Novel C-aryl glucoside SGLT2 inhibitors as potential antidiabetic agents: 1,3,4-Thiadiazolylmethylphenyl glucoside congeners. Bioorg Med Chem 18:2178-94 (2010)  
Target
Name:
Sodium/glucose cotransporter 2
Synonyms:
Na(+)/glucose cotransporter 2 SGLT2 Sodium-Dependent Glucose Cotransporter 2 (SGLT2) Solute carrier family 5 member 2
Type:
Protein
Mol. Mass.:
72902.00
Organism:
Homo sapiens (Human)
Description:
P31639
Residue:
672
  
Inhibitor
Name:
BDBM20878
Synonyms:
(2R,3S,4S,5R,6S)-2-(hydroxymethyl)-6-{2-[(4-methoxyphenyl)methyl]phenoxy}oxane-3,4,5-triol O-glucoside, 4a
Type:
Small organic molecule
Emp. Form.:
C20H24O7
Mol. Mass.:
376.4004
SMILES:
COc1ccc(Cc2ccccc2O[C@@H]2O[C@H](CO)[C@@H](O)[C@H](O)[C@H]2O)cc1
: