Target
Carbonic anhydrase 14
Ligand
BDBM50187132
Substrate
Meas. Tech.
ChEMBL_613339 (CHEMBL1074276)
Ki
9140±n/a nM
Citation
 Innocenti, ABeyza Oztürk Sarikaya, SGülçin, ISupuran, CT Carbonic anhydrase inhibitors. Inhibition of mammalian isoforms I-XIV with a series of natural product polyphenols and phenolic acids. Bioorg Med Chem 18:2159-64 (2010)  
Target
Name:
Carbonic anhydrase 14
Synonyms:
CA-XIV CAH14_HUMAN Carbonic Anhydrase XIV Carbonic anhydrase 14 Carbonic anhydrase XIV (CA XIV)
Type:
Enzyme
Mol. Mass.:
37665.67
Organism:
Homo sapiens (Human)
Description:
Human (cloned) isozyme.
Residue:
337
  
Inhibitor
Name:
BDBM50187132
Synonyms:
3,5-Dimethoxy-4-hydroxybenzoic acid CHEMBL1414 | Syringic acid
Type:
Small organic molecule
Emp. Form.:
C9H10O5
Mol. Mass.:
198.1727
SMILES:
COc1cc(cc(OC)c1O)C(O)=O
: