Target
Carbonic anhydrase 9
Ligand
BDBM50085536
Substrate
Meas. Tech.
ChEMBL_613336 (CHEMBL1074273)
Ki
6990±n/a nM
Citation
 Innocenti, ABeyza Oztürk Sarikaya, SGülçin, ISupuran, CT Carbonic anhydrase inhibitors. Inhibition of mammalian isoforms I-XIV with a series of natural product polyphenols and phenolic acids. Bioorg Med Chem 18:2159-64 (2010)  
Target
Name:
Carbonic anhydrase 9
Synonyms:
CA-IX CAH9_HUMAN Carbonic anhydrase 9 (CA IX) Carbonic anhydrase 9 precursor Carbonic anhydrase IX (CAIX) Carbonic anhydrases; II & IX MN RCC-associated antigen G250
Type:
Enzyme
Mol. Mass.:
49669.03
Organism:
Homo sapiens (Human)
Description:
Catalytic domain of human cloned isozyme was used in the assay
Residue:
459
  
Inhibitor
Name:
BDBM50085536
Synonyms:
3,4,5-Trihydroxybenzoate, X CHEMBL288114 gallic acid
Type:
Small organic molecule
Emp. Form.:
C7H6O5
Mol. Mass.:
170.1195
SMILES:
OC(=O)c1cc(O)c(O)c(O)c1
: