Target
Carbonic anhydrase 14
Ligand
BDBM4374
Substrate
Meas. Tech.
ChEMBL_613339 (CHEMBL1074276)
Ki
6680±n/a nM
Citation
 Innocenti, ABeyza Oztürk Sarikaya, SGülçin, ISupuran, CT Carbonic anhydrase inhibitors. Inhibition of mammalian isoforms I-XIV with a series of natural product polyphenols and phenolic acids. Bioorg Med Chem 18:2159-64 (2010)  
Target
Name:
Carbonic anhydrase 14
Synonyms:
CA-XIV CAH14_HUMAN Carbonic Anhydrase XIV Carbonic anhydrase 14 Carbonic anhydrase XIV (CA XIV)
Type:
Enzyme
Mol. Mass.:
37665.67
Organism:
Homo sapiens (Human)
Description:
Human (cloned) isozyme.
Residue:
337
  
Inhibitor
Name:
BDBM4374
Synonyms:
(2E)-3-(4-hydroxyphenyl)prop-2-enoic acid CHEMBL66879 p-Hydroxycinnamic acid (p-HCA) p-hydroxycinnamic acid (M4)
Type:
Small organic molecule
Emp. Form.:
C9H8O3
Mol. Mass.:
164.158
SMILES:
OC(=O)\C=C\c1ccc(O)cc1
: