Target
Adenosine receptor A2a
Ligand
BDBM50079652
Substrate
Meas. Tech.
ChEMBL_613345 (CHEMBL1074282)
IC50
11300±n/a nM
Citation
 Scheiff, ABYerande, SGEl-Tayeb, ALi, WInamdar, GSVasu, KKSudarsanam, VMüller, CE 2-Amino-5-benzoyl-4-phenylthiazoles: Development of potent and selective adenosine A1 receptor antagonists. Bioorg Med Chem 18:2195-203 (2010)  
Target
Name:
Adenosine receptor A2a
Synonyms:
AA2AR_RAT Adenosine A2 receptor Adenosine Receptors A2a (A2a) Adenosine receptors A2a Rat striatal adenosine A2a receptor
Type:
G Protein-Coupled Receptor (GPCR)
Mol. Mass.:
45015.65
Organism:
Rattus norvegicus (rat)
Description:
Rat A2A receptors expressed in CHO cells.
Residue:
410
  
Inhibitor
Name:
BDBM50079652
Synonyms:
(E)-1-[(R)-2-(2-Hydroxy-ethyl)-piperidin-1-yl]-3-(2-phenyl-pyrazolo[1,5-a]pyridin-3-yl)-propenone 1-[2-(2-Hydroxy-ethyl)-piperidin-1-yl]-3-(2-phenyl-pyrazolo[1,5-a]pyridin-3-yl)-propenone FK-453
Type:
Small organic molecule
Emp. Form.:
C23H25N3O2
Mol. Mass.:
375.4635
SMILES:
OCC[C@H]1CCCCN1C(=O)\C=C\c1c(nn2ccccc12)-c1ccccc1
: