Target
Adenosine receptor A1
Ligand
BDBM50308491
Substrate
Meas. Tech.
ChEMBL_613344 (CHEMBL1074281)
Ki
57±n/a nM
Citation
 Scheiff, ABYerande, SGEl-Tayeb, ALi, WInamdar, GSVasu, KKSudarsanam, VMüller, CE 2-Amino-5-benzoyl-4-phenylthiazoles: Development of potent and selective adenosine A1 receptor antagonists. Bioorg Med Chem 18:2195-203 (2010)  
Target
Name:
Adenosine receptor A1
Synonyms:
A1 adenosine receptor (hA1) AA1R_HUMAN ADORA1 Adenosine A1-receptor Adenosine receptor A1 (hA1) | Adenosine transporter (AdT)
Type:
G Protein-Coupled Receptor (GPCR)
Mol. Mass.:
36520.92
Organism:
Homo sapiens (Human)
Description:
P30542
Residue:
326
  
Inhibitor
Name:
BDBM50308491
Synonyms:
CHEMBL592679 | N-(5-(4-Methylbenzoyl)-4-phenylthiazol-2-yl)benzamide
Type:
Small organic molecule
Emp. Form.:
C24H18N2O2S
Mol. Mass.:
398.477
SMILES:
Cc1ccc(cc1)C(=O)c1sc(NC(=O)c2ccccc2)nc1-c1ccccc1
: