Target
Cystine/glutamate transporter
Ligand
BDBM50109609
Substrate
Meas. Tech.
ChEMBL_607278 (CHEMBL1072820)
Ki
59000±n/a nM
Citation
 Patel, SARajale, TO'Brien, EBurkhart, DJNelson, JKTwamley, BBlumenfeld, ASzabon-Watola, MIGerdes, JMBridges, RJNatale, NR Isoxazole analogues bind the system xc- transporter: structure-activity relationship and pharmacophore model. Bioorg Med Chem 18:202-13 (2010)  
Target
Name:
Cystine/glutamate transporter
Synonyms:
SLC7A11 | XCT_HUMAN
Type:
PROTEIN
Mol. Mass.:
55437.48
Organism:
Homo sapiens (Human)
Description:
ChEMBL_772170
Residue:
501
  
Inhibitor
Name:
BDBM50109609
Synonyms:
(2R)-2-amino-3-mercaptopropanoic acid (R)-2-amino-3-mercaptopropanoic acid CYSTEINE L-Cystein L-cysteine | US11021454, Compound L-cys
Type:
Small organic molecule
Emp. Form.:
C3H7NO2S
Mol. Mass.:
121.158
SMILES:
N[C@@H](CS)C(O)=O
: