Target
Mitogen-activated protein kinase kinase kinase 11
Ligand
BDBM50308876
Substrate
Meas. Tech.
ChEMBL_611408 (CHEMBL1065739)
IC50
>10000±n/a nM
Citation
 Morwick, TBüttner, FHCywin, CLDahmann, GHickey, EJakes, SKaplita, PKashem, MAKerr, SKugler, SMao, WMarshall, DPaw, ZShih, CKWu, FYoung, E Hit to lead account of the discovery of bisbenzamide and related ureidobenzamide inhibitors of Rho kinase. J Med Chem 53:759-77 (2010)  
Target
Name:
Mitogen-activated protein kinase kinase kinase 11
Synonyms:
M3K11_HUMAN MLK3 Mixed Lineage Kinase 3 (MLK3) SPRK
Type:
PROTEIN
Mol. Mass.:
92696.93
Organism:
Homo sapiens (Human)
Description:
ChEMBL_1460565
Residue:
847
  
Inhibitor
Name:
BDBM50308876
Synonyms:
3,4-Dimethoxy-N-[3-(1,2,3,4-tetrahydro-isoquinolin-7-ylcarbamoyl)-benzyl]-benzamide | CHEMBL604087
Type:
Small organic molecule
Emp. Form.:
C26H27N3O4
Mol. Mass.:
445.5103
SMILES:
COc1ccc(cc1OC)C(=O)NCc1cccc(c1)C(=O)Nc1ccc2CCNCc2c1
: