Target
Serine/threonine-protein kinase N2
Ligand
BDBM50308862
Substrate
Meas. Tech.
ChEMBL_607697 (CHEMBL1066162)
IC50
1600±n/a nM
Citation
 Morwick, TBüttner, FHCywin, CLDahmann, GHickey, EJakes, SKaplita, PKashem, MAKerr, SKugler, SMao, WMarshall, DPaw, ZShih, CKWu, FYoung, E Hit to lead account of the discovery of bisbenzamide and related ureidobenzamide inhibitors of Rho kinase. J Med Chem 53:759-77 (2010)  
Target
Name:
Serine/threonine-protein kinase N2
Synonyms:
PKN2 PRK2 Protein kinase C-like 2 Protein-kinase C-related kinase 2 | Serine/threonine-protein kinase N2
Type:
PROTEIN
Mol. Mass.:
112029.78
Organism:
Homo sapiens (Human)
Description:
ChEMBL_1433151
Residue:
984
  
Inhibitor
Name:
BDBM50308862
Synonyms:
3-[3-(4-Cyano-phenyl)-ureidomethyl]-N-(1,2,3,4-tetrahydro-isoquinolin-7-yl)-benzamide | CHEMBL590810
Type:
Small organic molecule
Emp. Form.:
C25H23N5O2
Mol. Mass.:
425.4824
SMILES:
O=C(NCc1cccc(c1)C(=O)Nc1ccc2CCNCc2c1)Nc1ccc(cc1)C#N
: