Target
Serine/threonine-protein kinase N2
Ligand
BDBM50308866
Substrate
Meas. Tech.
ChEMBL_607697 (CHEMBL1066162)
IC50
>5000±n/a nM
Citation
 Morwick, TBüttner, FHCywin, CLDahmann, GHickey, EJakes, SKaplita, PKashem, MAKerr, SKugler, SMao, WMarshall, DPaw, ZShih, CKWu, FYoung, E Hit to lead account of the discovery of bisbenzamide and related ureidobenzamide inhibitors of Rho kinase. J Med Chem 53:759-77 (2010)  
Target
Name:
Serine/threonine-protein kinase N2
Synonyms:
PKN2 PRK2 Protein kinase C-like 2 Protein-kinase C-related kinase 2 | Serine/threonine-protein kinase N2
Type:
PROTEIN
Mol. Mass.:
112029.78
Organism:
Homo sapiens (Human)
Description:
ChEMBL_1433151
Residue:
984
  
Inhibitor
Name:
BDBM50308866
Synonyms:
3-Chloro-N-[3-(4-dimethylaminomethyl-phenylcarbamoyl)-benzyl]-4-methoxy-benzamide | CHEMBL592709
Type:
Small organic molecule
Emp. Form.:
C25H26ClN3O3
Mol. Mass.:
451.945
SMILES:
COc1ccc(cc1Cl)C(=O)NCc1cccc(c1)C(=O)Nc1ccc(CN(C)C)cc1
: