Target
cGMP-inhibited 3',5'-cyclic phosphodiesterase 3A
Ligand
BDBM50308954
Substrate
Meas. Tech.
ChEMBL_611750 (CHEMBL1065787)
IC50
640±n/a nM
Citation
 Nikpour, MSadeghian, HSaberi, MRNick, RSSeyedi, SMHosseini, AParsaee, HBozorg, AT Design, synthesis and biological evaluation of 6-(benzyloxy)-4-methylquinolin-2(1H)-one derivatives as PDE3 inhibitors. Bioorg Med Chem 18:855-62 (2010)  
Target
Name:
cGMP-inhibited 3',5'-cyclic phosphodiesterase 3A
Synonyms:
3',5'-cyclic phosphodiesterase Cyclic GMP-inhibited phosphodiesterase A PDE3A_HUMAN Phosphodiesterase 3 (PDE3) Phosphodiesterase 3A Phosphodiesterase 3A (PDE3A1) cGMP-inhibited 3',5'-cyclic phosphodiesterase A | cGMP-inhibited 3,5-cyclic phosphodiesterase A
Type:
Enzyme
Mol. Mass.:
124966.46
Organism:
Homo sapiens (Human)
Description:
Q14432
Residue:
1141
  
Inhibitor
Name:
BDBM50308954
Synonyms:
4-Methyl-6-{[3-(tetrahydro-1H-1-pyrrolylcarbonyl)-benzyl]oxy}-1,2-dihydro-2-quinolinone | CHEMBL592057
Type:
Small organic molecule
Emp. Form.:
C22H22N2O3
Mol. Mass.:
362.4217
SMILES:
Cc1cc(=O)[nH]c2ccc(OCc3cccc(c3)C(=O)N3CCCC3)cc12
: