Target
Serine/threonine-protein kinase Chk2
Ligand
BDBM50309191
Substrate
Meas. Tech.
ChEMBL_608807 (CHEMBL1068399)
IC50
28±n/a nM
Citation
 Hilton, SNaud, SCaldwell, JJBoxall, KBurns, SAnderson, VEAntoni, LAllen, CEPearl, LHOliver, AWWynne Aherne, GGarrett, MDCollins, I Identification and characterisation of 2-aminopyridine inhibitors of checkpoint kinase 2. Bioorg Med Chem 18:707-18 (2010)  
Target
Name:
Serine/threonine-protein kinase Chk2
Synonyms:
CDS1 CHK2 Checkpoint Kinase (Chk2) Serine/threonine-protein kinase Chek2 | Serine/threonine-protein kinase Chk1/2
Type:
Protein
Mol. Mass.:
60908.59
Organism:
Homo sapiens (Human)
Description:
O96017
Residue:
543
  
Inhibitor
Name:
BDBM50309191
Synonyms:
2-Amino-N-(2-aminoethyl)-5-(2,3-dihydrothieno[3,4-b][1,4]dioxin-5-yl)nicotinamide | CHEMBL599171
Type:
Small organic molecule
Emp. Form.:
C14H16N4O3S
Mol. Mass.:
320.367
SMILES:
NCCNC(=O)c1cc(cnc1N)-c1scc2OCCOc12
: