Target
Serine/threonine-protein kinase Chk1
Ligand
BDBM50309182
Substrate
Meas. Tech.
ChEMBL_608809 (CHEMBL1068401)
IC50
5200±n/a nM
Citation
 Hilton, SNaud, SCaldwell, JJBoxall, KBurns, SAnderson, VEAntoni, LAllen, CEPearl, LHOliver, AWWynne Aherne, GGarrett, MDCollins, I Identification and characterisation of 2-aminopyridine inhibitors of checkpoint kinase 2. Bioorg Med Chem 18:707-18 (2010)  
Target
Name:
Serine/threonine-protein kinase Chk1
Synonyms:
CHEK1 CHK1 checkpoint homolog Checkpoint kinase-1 (CHK1)
Type:
Enzyme Catalytic Domain
Mol. Mass.:
54443.02
Organism:
Homo sapiens (Human)
Description:
gi_166295192
Residue:
476
  
Inhibitor
Name:
BDBM50309182
Synonyms:
4-(2-Amino-5-(2,3-dihydrothieno[3,4-b][1,4]dioxin-5-yl)pyridin-3-yl)benzamide CHEMBL602931
Type:
Small organic molecule
Emp. Form.:
C18H15N3O3S
Mol. Mass.:
353.395
SMILES:
NC(=O)c1ccc(cc1)-c1cc(cnc1N)-c1scc2OCCOc12
: