Target
Succinyl-diaminopimelate desuccinylase
Ligand
BDBM50311534
Substrate
Meas. Tech.
ChEMBL_617887 (CHEMBL1101552)
IC50
13700±n/a nM
Citation
 Gillner, DArmoush, NHolz, RCBecker, DP Inhibitors of bacterial N-succinyl-L,L-diaminopimelic acid desuccinylase (DapE) and demonstration of in vitro antimicrobial activity. Bioorg Med Chem Lett 19:6350-2 (2009)  
Target
Name:
Succinyl-diaminopimelate desuccinylase
Synonyms:
DAPE_HAEIN | dapE
Type:
PROTEIN
Mol. Mass.:
41343.05
Organism:
Haemophilus influenzae
Description:
ChEMBL_617887
Residue:
377
  
Inhibitor
Name:
BDBM50311534
Synonyms:
3-sulfanyl-L-valine L-Penicillamine
Type:
Small organic molecule
Emp. Form.:
C5H11NO2S
Mol. Mass.:
149.211
SMILES:
CC(C)(S)[C@H](N)C(O)=O
: