Target
Heat shock protein HSP 90-beta
Ligand
BDBM20800
Substrate
Meas. Tech.
ChEMBL_616152 (CHEMBL1103015)
Ki
13±n/a nM
Citation
 Biamonte, MAVan de Water, RArndt, JWScannevin, RHPerret, DLee, WC Heat shock protein 90: inhibitors in clinical trials. J Med Chem 53:3-17 (2010)  
Target
Name:
Heat shock protein HSP 90-beta
Synonyms:
HS90B_HUMAN HSP 90 HSP90B HSPCB Heat shock protein HSP 90 (Hsp90)
Type:
Molecular Chaperone
Mol. Mass.:
83229.45
Organism:
Homo sapiens (Human)
Description:
P08238
Residue:
724
  
Inhibitor
Name:
BDBM20800
Synonyms:
2-amino-6-halopurine analogue, 20 CHEMBL467399 | hsp90_107
Type:
Small organic molecule
Emp. Form.:
C14H15ClN6O
Mol. Mass.:
318.762
SMILES:
COc1c(C)cnc(Cn2cnc3c(Cl)nc(N)nc23)c1C
: