Target
Endoplasmin
Ligand
BDBM20926
Substrate
Meas. Tech.
ChEMBL_616199 (CHEMBL1100284)
IC50
85±n/a nM
Citation
 Biamonte, MAVan de Water, RArndt, JWScannevin, RHPerret, DLee, WC Heat shock protein 90: inhibitors in clinical trials. J Med Chem 53:3-17 (2010)  
Target
Name:
Endoplasmin
Synonyms:
94 kDa glucose-regulated protein GRP-94 Glucose regulated protein 94kDa (Grp94) Heat shock protein 90 kDa beta member 1 Tumor rejection antigen 1 | gp96 homolog
Type:
Protein
Mol. Mass.:
92417.36
Organism:
Homo sapiens (Human)
Description:
P14625
Residue:
803
  
Inhibitor
Name:
BDBM20926
Synonyms:
5-[2,4-dihydroxy-5-(propan-2-yl)phenyl]-N-ethyl-4-[4-(morpholin-4-ylmethyl)phenyl]-1,2-oxazole-3-carboxamide VER-52296/NVP-AUY922
Type:
Small organic molecule
Emp. Form.:
C26H31N3O5
Mol. Mass.:
465.5414
SMILES:
CCNC(=O)c1noc(c1-c1ccc(CN2CCOCC2)cc1)-c1cc(C(C)C)c(O)cc1O
: