Target
Phosphatidylinositol 4,5-bisphosphate 3-kinase catalytic subunit gamma isoform
Ligand
BDBM50313050
Substrate
Meas. Tech.
ChEMBL_616305 (CHEMBL1102108)
Ki
1300±n/a nM
Citation
 Arnost, MPierce, Ater Haar, ELauffer, DMadden, JTanner, KGreen, J 3-Aryl-4-(arylhydrazono)-1H-pyrazol-5-ones: Highly ligand efficient and potent inhibitors of GSK3beta. Bioorg Med Chem Lett 20:1661-4 (2010)  
Target
Name:
Phosphatidylinositol 4,5-bisphosphate 3-kinase catalytic subunit gamma isoform
Synonyms:
PI3-kinase p110 subunit gamma PI3Kgamma PK3CG_HUMAN Phosphatidylinositol 4,5-bisphosphate 3-kinase (PI3K) Phosphatidylinositol 4,5-bisphosphate 3-kinase catalytic subunit gamma (PI3Kgamma) Phosphatidylinositol 4,5-bisphosphate 3-kinase catalytic subunit gamma isoform (PI3K) Phosphatidylinositol-4,5-bisphosphate 3-kinase catalytic subunit gamma isoform Phosphoinositide 3-kinases gamma (PI3K gamma) p120-PI3K
Type:
Enzyme Subunit
Mol. Mass.:
126470.30
Organism:
Homo sapiens (Human)
Description:
P48736
Residue:
1102
  
Inhibitor
Name:
BDBM50313050
Synonyms:
(Z)-3-(4-methoxyphenyl)-4-(2-(3-methoxyphenyl)hydrazono)-1H-pyrazol-5(4H)-one | CHEMBL1080902
Type:
Small organic molecule
Emp. Form.:
C17H16N4O3
Mol. Mass.:
324.3339
SMILES:
COc1ccc(cc1)-c1[nH][nH]c(=O)c1N=Nc1cccc(OC)c1
: