Target
Kinesin-like protein KIF11
Ligand
BDBM50313442
Substrate
Meas. Tech.
ChEMBL_617338 (CHEMBL1101849)
IC50
3±n/a nM
Citation
 Schiemann, KFinsinger, DZenke, FAmendt, CKnöchel, TBruge, DBuchstaller, HPEmde, UStähle, WAnzali, S The discovery and optimization of hexahydro-2H-pyrano[3,2-c]quinolines (HHPQs) as potent and selective inhibitors of the mitotic kinesin-5. Bioorg Med Chem Lett 20:1491-5 (2010)  
Target
Name:
Kinesin-like protein KIF11
Synonyms:
EG5 KIF11_HUMAN Kinesin Spindle Protein Eg5 TRIP5 | kinesin spindle protein
Type:
PROTEIN
Mol. Mass.:
119138.97
Organism:
Homo sapiens (Human)
Description:
ChEMBL_1457426
Residue:
1056
  
Inhibitor
Name:
BDBM50313442
Synonyms:
1-((2R,4aS,5R,10bS)-9-bromo-7-fluoro-5-phenyl-3,4,4a,5,6,10b-hexahydro-2H-pyrano[3,2-c]quinolin-2-yl)-N-methylmethanamine | CHEMBL1082248
Type:
Small organic molecule
Emp. Form.:
C20H22BrFN2O
Mol. Mass.:
405.304
SMILES:
CNC[C@H]1CC[C@H]2[C@@H](Nc3c(F)cc(Br)cc3[C@H]2O1)c1ccccc1
: