Target
Thymidylate synthase
Ligand
BDBM50314077
Substrate
Meas. Tech.
ChEMBL_627425 (CHEMBL1115355)
IC50
390±n/a nM
Citation
 Gangjee, AZaware, NRaghavan, SIhnat, MShenoy, SKisliuk, RL Single agents with designed combination chemotherapy potential: synthesis and evaluation of substituted pyrimido[4,5-b]indoles as receptor tyrosine kinase and thymidylate synthase inhibitors and as antitumor agents. J Med Chem 53:1563-78 (2010)  
Target
Name:
Thymidylate synthase
Synonyms:
TS TYMS Thymidylate synthase (TS) | Thymidylate synthase/GAR transformylase/AICAR transformylase
Type:
Enzyme
Mol. Mass.:
35718.07
Organism:
Homo sapiens (Human)
Description:
Residue:
313
  
Inhibitor
Name:
BDBM50314077
Synonyms:
5-(p-tolylthio)-9H-pyrimido[4,5-b]indole-2,4-diamine US9422297, AAG-148-311
Type:
Small organic molecule
Emp. Form.:
C17H15N5S
Mol. Mass.:
321.4
SMILES:
Cc1ccc(Sc2cccc3[nH]c4nc(N)nc(N)c4c23)cc1
: