Target
Metabotropic glutamate receptor 8
Ligand
BDBM50314797
Substrate
Meas. Tech.
ChEMBL_627229 (CHEMBL1110798)
EC50
8300±n/a nM
Citation
 Selvam, COueslati, NLemasson, IABrabet, IRigault, DCourtiol, TCesarini, STriballeau, NBertrand, HOGoudet, CPin, JPAcher, FC A virtual screening hit reveals new possibilities for developing group III metabotropic glutamate receptor agonists. J Med Chem 53:2797-813 (2010)  
Target
Name:
Metabotropic glutamate receptor 8
Synonyms:
GRM8_RAT Grm8 Metabotropic glutamate receptor 8 (mGlu8) glutamate receptor, metabotropic 8 precursor metabotropic glutamate 8
Type:
Enzyme
Mol. Mass.:
101886.18
Organism:
Rattus norvegicus (Rat)
Description:
P70579
Residue:
908
  
Inhibitor
Name:
BDBM50314797
Synonyms:
(3S)-3-[((3-Amino-3-carboxy)propyl)(hydroxy)phosphinyl]-2-chloropropanoic Acid | CHEMBL1076865
Type:
Small organic molecule
Emp. Form.:
C7H13ClNO6P
Mol. Mass.:
273.608
SMILES:
N[C@@H](CCP(O)(=O)CC(Cl)C(O)=O)C(O)=O
: