Target
Metabotropic glutamate receptor 4
Ligand
BDBM50314807
Substrate
Meas. Tech.
ChEMBL_627220 (CHEMBL1110789)
EC50
26000±n/a nM
Citation
 Selvam, COueslati, NLemasson, IABrabet, IRigault, DCourtiol, TCesarini, STriballeau, NBertrand, HOGoudet, CPin, JPAcher, FC A virtual screening hit reveals new possibilities for developing group III metabotropic glutamate receptor agonists. J Med Chem 53:2797-813 (2010)  
Target
Name:
Metabotropic glutamate receptor 4
Synonyms:
GRM4_RAT Grm4 Metabotropic glutamate receptor 4 (mGlu4) mGlu4 metabotropic glutamate 4a
Type:
Enzyme
Mol. Mass.:
101849.79
Organism:
Rattus norvegicus (Rat)
Description:
P31423
Residue:
912
  
Inhibitor
Name:
BDBM50314807
Synonyms:
(3S)-3-[((3-Amino-3-carboxy)propyl)(hydroxy)phosphinyl]-3-trifluoromethypropanoic Acid | CHEMBL1093010
Type:
Small organic molecule
Emp. Form.:
C8H13F3NO6P
Mol. Mass.:
307.1609
SMILES:
N[C@@H](CCP(O)(=O)C(CC(O)=O)C(F)(F)F)C(O)=O
: