Target
Metabotropic glutamate receptor 4
Ligand
BDBM50314809
Substrate
Meas. Tech.
ChEMBL_627220 (CHEMBL1110789)
EC50
12100±n/a nM
Citation
 Selvam, COueslati, NLemasson, IABrabet, IRigault, DCourtiol, TCesarini, STriballeau, NBertrand, HOGoudet, CPin, JPAcher, FC A virtual screening hit reveals new possibilities for developing group III metabotropic glutamate receptor agonists. J Med Chem 53:2797-813 (2010)  
Target
Name:
Metabotropic glutamate receptor 4
Synonyms:
GRM4_RAT Grm4 Metabotropic glutamate receptor 4 (mGlu4) mGlu4 metabotropic glutamate 4a
Type:
Enzyme
Mol. Mass.:
101849.79
Organism:
Rattus norvegicus (Rat)
Description:
P31423
Residue:
912
  
Inhibitor
Name:
BDBM50314809
Synonyms:
(3S)-3-[((3-Amino-3-carboxy)propyl)(hydroxy)phosphinyl]-2-methylpropanoic Acid | CHEMBL1092311
Type:
Small organic molecule
Emp. Form.:
C8H16NO6P
Mol. Mass.:
253.1895
SMILES:
CC(CP(O)(=O)CC[C@H](N)C(O)=O)C(O)=O
: