Target
Metabotropic glutamate receptor 6
Ligand
BDBM50314801
Substrate
Meas. Tech.
ChEMBL_627225 (CHEMBL1110794)
EC50
42000±n/a nM
Citation
 Selvam, COueslati, NLemasson, IABrabet, IRigault, DCourtiol, TCesarini, STriballeau, NBertrand, HOGoudet, CPin, JPAcher, FC A virtual screening hit reveals new possibilities for developing group III metabotropic glutamate receptor agonists. J Med Chem 53:2797-813 (2010)  
Target
Name:
Metabotropic glutamate receptor 6
Synonyms:
GRM6_RAT Grm6 Metabotropic glutamate receptor 6 (mGlu6) mGlu6 | metabotropic glutamate 6
Type:
Enzyme
Mol. Mass.:
95095.82
Organism:
Rattus norvegicus (Rat)
Description:
P35349
Residue:
871
  
Inhibitor
Name:
BDBM50314801
Synonyms:
(3S)-2-[(((3-Amino-3-carboxy)propyl)(hydroxy)phosphinyl)-methyl]butan-1,4-dioic Acid | CHEMBL1092315
Type:
Small organic molecule
Emp. Form.:
C9H16NO8P
Mol. Mass.:
297.199
SMILES:
N[C@@H](CCP(O)(=O)CC(CC(O)=O)C(O)=O)C(O)=O
: