Target
Vesicular acetylcholine transporter
Ligand
BDBM50378735
Substrate
Meas. Tech.
ChEMBL_627490 (CHEMBL1111776)
Ki
2.08±n/a nM
Citation
 Efange, SMKhare, ABvon Hohenberg, KMach, RHParsons, SMTu, Z Synthesis and in vitro biological evaluation of carbonyl group-containing inhibitors of vesicular acetylcholine transporter. J Med Chem 53:2825-35 (2010)  
Target
Name:
Vesicular acetylcholine transporter
Synonyms:
TorVAChT VAChT
Type:
PROTEIN
Mol. Mass.:
56111.93
Organism:
Torpedo californica
Description:
ChEMBL_1503355
Residue:
515
  
Inhibitor
Name:
BDBM50378735
Synonyms:
CHEMBL1204049
Type:
Small organic molecule
Emp. Form.:
C27H35N3O2
Mol. Mass.:
433.5857
SMILES:
O[C@@H]1Cc2ccccc2C[C@H]1N1CCC(CC1)C(=O)N1CCN(Cc2ccccc2)CC1
: