Target
Melanocyte-stimulating hormone receptor
Ligand
BDBM50315676
Substrate
Meas. Tech.
ChEMBL_624018 (CHEMBL1116904)
EC50
>11900±n/a nM
Citation
 Lansdell, MIHepworth, DCalabrese, ABrown, ADBlagg, JBurring, DJWilson, PFradet, DBrown, TBQuinton, FMistry, NTang, KMount, NStacey, PEdmunds, NAdams, CGaboardi, SNeal-Morgan, SWayman, CCole, SPhipps, JLewis, MVerrier, HGillon, VFeeder, NHeatherington, ASultana, SHaughie, SMartin, SWSudworth, MTweedy, S Discovery of a selective small-molecule melanocortin-4 receptor agonist with efficacy in a pilot study of sexual dysfunction in humans. J Med Chem 53:3183-97 (2010)  
Target
Name:
Melanocyte-stimulating hormone receptor
Synonyms:
MC1-R MSH-R MSHR_HUMAN Melanocortin receptor (M1 and M4) Melanocortin receptor 1 (MC1-R) | Melanocortin receptor 1 (MC1R)
Type:
Enzyme
Mol. Mass.:
34717.23
Organism:
Homo sapiens (Human)
Description:
Q01726
Residue:
317
  
Inhibitor
Name:
BDBM50315676
Synonyms:
((3R,4S)-4-(2,4-difluorophenyl)-1-(tetrahydro-2H-pyran-4-yl)pyrrolidin-3-yl)((3S,4S,5R)-4-hydroxy-3,5-dimethyl-4-phenylpiperidin-1-yl)methanone | CHEMBL1092573
Type:
Small organic molecule
Emp. Form.:
C29H36F2N2O3
Mol. Mass.:
498.6045
SMILES:
C[C@H]1CN(C[C@@H](C)[C@]1(O)c1ccccc1)C(=O)[C@H]1CN(C[C@@H]1c1ccc(F)cc1F)C1CCOCC1
: