Target
Dihydrofolate reductase
Ligand
BDBM50316132
Substrate
Meas. Tech.
ChEMBL_623482 (CHEMBL1113553)
IC50
2000±n/a nM
Citation
 Al-Omary, FAAbou-Zeid, LANagi, MNHabib, el-SEAbdel-Aziz, AAEl-Azab, ASAbdel-Hamide, SGAl-Omar, MAAl-Obaid, AMEl-Subbagh, HI Non-classical antifolates. Part 2: synthesis, biological evaluation, and molecular modeling study of some new 2,6-substituted-quinazolin-4-ones. Bioorg Med Chem 18:2849-63 (2010)  
Target
Name:
Dihydrofolate reductase
Synonyms:
DHFR Dihydrofolate reductase | Dihydrofolate reductase (DHFR)
Type:
Enzyme
Mol. Mass.:
21603.71
Organism:
Bos taurus (Cattle)
Description:
P00376
Residue:
187
  
Inhibitor
Name:
BDBM50316132
Synonyms:
2-Allylthio-3-benzyl-6-methyl-quinazolin-4(3H)-one | CHEMBL1091255
Type:
Small organic molecule
Emp. Form.:
C19H18N2OS
Mol. Mass.:
322.424
SMILES:
Cc1ccc2nc(SCC=C)n(Cc3ccccc3)c(=O)c2c1
: