Target
Dihydrofolate reductase
Ligand
BDBM50316107
Substrate
Meas. Tech.
ChEMBL_623482 (CHEMBL1113553)
IC50
35000±n/a nM
Citation
 Al-Omary, FAAbou-Zeid, LANagi, MNHabib, el-SEAbdel-Aziz, AAEl-Azab, ASAbdel-Hamide, SGAl-Omar, MAAl-Obaid, AMEl-Subbagh, HI Non-classical antifolates. Part 2: synthesis, biological evaluation, and molecular modeling study of some new 2,6-substituted-quinazolin-4-ones. Bioorg Med Chem 18:2849-63 (2010)  
Target
Name:
Dihydrofolate reductase
Synonyms:
DHFR Dihydrofolate reductase | Dihydrofolate reductase (DHFR)
Type:
Enzyme
Mol. Mass.:
21603.71
Organism:
Bos taurus (Cattle)
Description:
P00376
Residue:
187
  
Inhibitor
Name:
BDBM50316107
Synonyms:
3-Benzyl-2-ethylthio-6-methyl-quinazolin-4(3H)-one | CHEMBL1090604
Type:
Small organic molecule
Emp. Form.:
C18H18N2OS
Mol. Mass.:
310.413
SMILES:
CCSc1nc2ccc(C)cc2c(=O)n1Cc1ccccc1
: