Target
Aurora kinase B
Ligand
BDBM50316479
Substrate
Meas. Tech.
ChEMBL_630516 (CHEMBL1104788)
IC50
4.7±n/a nM
Citation
Target
Name:
Aurora kinase B
Synonyms:
AIK2 AIM1 ARK2 AURKB_HUMAN Aurora B-INCENP Aurora kinase B (AURKB) STK-1 STK12 Serine/threonine-protein kinase aurora B
Type:
Protein
Mol. Mass.:
39327.72
Organism:
Homo sapiens (Human)
Description:
Q96GD4
Residue:
344
  
Inhibitor
Name:
BDBM50316479
Synonyms:
(4-[3-(4-N-Ethylcarbamylaminophenyl)-1-ethyl-1H-pyrazol-4-yl]-2-[4-(N-morpholinylmethyl)phenyl]-1H-pyrrolo[2,3-b]pyridine | CHEMBL1094702
Type:
Small organic molecule
Emp. Form.:
C32H35N7O2
Mol. Mass.:
549.666
SMILES:
CCNC(=O)Nc1ccc(cc1)-c1nn(CC)cc1-c1ccnc2[nH]c(cc12)-c1ccc(CN2CCOCC2)cc1
: