Target
Aurora kinase A
Ligand
BDBM50316477
Substrate
Meas. Tech.
ChEMBL_630519 (CHEMBL1104791)
IC50
70±n/a nM
Citation
Target
Name:
Aurora kinase A
Synonyms:
AIK ARK1 AURKA AYK1 Aurora kinase A (AURA) Aurora kinase A (Aurora A) Aurora-related kinase 1 BTAK Breast-tumor-amplified kinase STK15 Serine/threonine kinase 15 Serine/threonine-protein kinase aurora A hARK1
Type:
Serine/threonine-protein kinase
Mol. Mass.:
45830.98
Organism:
Homo sapiens (Human)
Description:
O14965
Residue:
403
  
Inhibitor
Name:
BDBM50316477
Synonyms:
4-[3-(4-N-Ethylcarbamylaminophenyl)-1-ethyl-1H-pyrazol-4-yl]-2-[3-(N-morpholinylmethyl)phenyl]-1H-pyrrolo[2,3-b]pyridine | CHEMBL1094700
Type:
Small organic molecule
Emp. Form.:
C32H35N7O2
Mol. Mass.:
549.666
SMILES:
CCNC(=O)Nc1ccc(cc1)-c1nn(CC)cc1-c1ccnc2[nH]c(cc12)-c1cccc(CN2CCOCC2)c1
: