Target
cGMP-specific 3',5'-cyclic phosphodiesterase
Ligand
BDBM50316646
Substrate
Meas. Tech.
ChEMBL_632193 (CHEMBL1106526)
IC50
0.05±n/a nM
Citation
 Tollefson, MBAcker, BAJacobsen, EJHughes, ROWalker, JKFox, DNPalmer, MJFreeman, SKYu, YBond, BR 1-(2-Ethoxyethyl)-1H-pyrazolo[4,3-d]pyrimidines as potent phosphodiesterase 5 (PDE5) inhibitors. Bioorg Med Chem Lett 20:3120-4 (2010)  
Target
Name:
cGMP-specific 3',5'-cyclic phosphodiesterase
Synonyms:
3',5'-cyclic phosphodiesterase PDE5 PDE5A_HUMAN Phosphodiesterase 5 (PDE5) Phosphodiesterase 5A (PDE5A) cGMP-specific 3',5'-cyclic phosphodiesterase
Type:
Protein
Mol. Mass.:
99975.83
Organism:
Homo sapiens (Human)
Description:
O76074
Residue:
875
  
Inhibitor
Name:
BDBM50316646
Synonyms:
1-(1-(2-ethoxyethyl)-3-methyl-7-(4-methylpyridin-2-ylamino)-1H-pyrazolo[4,3-d]pyrimidin-5-yl)piperidine-4-carboxylic acid | CHEMBL1094249
Type:
Small organic molecule
Emp. Form.:
C22H29N7O3
Mol. Mass.:
439.5108
SMILES:
CCOCCn1nc(C)c2nc(nc(Nc3cc(C)ccn3)c12)N1CCC(CC1)C(O)=O
: