Target
cGMP-specific 3',5'-cyclic phosphodiesterase
Ligand
BDBM50316669
Substrate
Meas. Tech.
ChEMBL_632193 (CHEMBL1106526)
IC50
0.78±n/a nM
Citation
 Tollefson, MBAcker, BAJacobsen, EJHughes, ROWalker, JKFox, DNPalmer, MJFreeman, SKYu, YBond, BR 1-(2-Ethoxyethyl)-1H-pyrazolo[4,3-d]pyrimidines as potent phosphodiesterase 5 (PDE5) inhibitors. Bioorg Med Chem Lett 20:3120-4 (2010)  
Target
Name:
cGMP-specific 3',5'-cyclic phosphodiesterase
Synonyms:
3',5'-cyclic phosphodiesterase PDE5 PDE5A_HUMAN Phosphodiesterase 5 (PDE5) Phosphodiesterase 5A (PDE5A) cGMP-specific 3',5'-cyclic phosphodiesterase
Type:
Protein
Mol. Mass.:
99975.83
Organism:
Homo sapiens (Human)
Description:
O76074
Residue:
875
  
Inhibitor
Name:
BDBM50316669
Synonyms:
5-(4-aminopiperidin-1-yl)-1-(2-ethoxyethyl)-3-ethyl-N-(4-methylpyridin-2-yl)-1H-pyrazolo[4,3-d]pyrimidin-7-amine | CHEMBL1094832
Type:
Small organic molecule
Emp. Form.:
C22H32N8O
Mol. Mass.:
424.5425
SMILES:
CCOCCn1nc(CC)c2nc(nc(Nc3cc(C)ccn3)c12)N1CCC(N)CC1
: