Target
Apoptosis regulator Bcl-2
Ligand
BDBM23223
Substrate
Meas. Tech.
ChEMBL_632204 (CHEMBL1106537)
IC50
300±n/a nM
Citation
 Wei, JStebbins, JLKitada, SDash, RPlaczek, WRega, MFWu, BCellitti, JZhai, DYang, LDahl, RFisher, PBReed, JCPellecchia, M BI-97C1, an optically pure Apogossypol derivative as pan-active inhibitor of antiapoptotic B-cell lymphoma/leukemia-2 (Bcl-2) family proteins. J Med Chem 53:4166-76 (2010)  
Target
Name:
Apoptosis regulator Bcl-2
Synonyms:
Apoptosis regulator Bcl-2 Protein BCL-2 BCL2_HUMAN | Bcl-2 Protein
Type:
Homodimer or heterodimer
Mol. Mass.:
26269.11
Organism:
Homo sapiens (Human)
Description:
P10415
Residue:
239
  
Inhibitor
Name:
BDBM23223
Synonyms:
7-[8-formyl-1,6,7-trihydroxy-3-methyl-5-(propan-2-yl)naphthalen-2-yl]-2,3,8-trihydroxy-6-methyl-4-(propan-2-yl)naphthalene-1-carbaldehyde Gossypol Gossypol, 4 Tash 1 cid_3503
Type:
Small organic molecule
Emp. Form.:
C30H30O8
Mol. Mass.:
518.5544
SMILES:
CC(C)c1c(O)c(O)c(C=O)c2c(O)c(c(C)cc12)-c1c(C)cc2c(C(C)C)c(O)c(O)c(C=O)c2c1O
: