Target
Bcl-2-related protein A1
Ligand
BDBM50316671
Substrate
Meas. Tech.
ChEMBL_632205 (CHEMBL1106538)
IC50
750±n/a nM
Citation
 Wei, JStebbins, JLKitada, SDash, RPlaczek, WRega, MFWu, BCellitti, JZhai, DYang, LDahl, RFisher, PBReed, JCPellecchia, M BI-97C1, an optically pure Apogossypol derivative as pan-active inhibitor of antiapoptotic B-cell lymphoma/leukemia-2 (Bcl-2) family proteins. J Med Chem 53:4166-76 (2010)  
Target
Name:
Bcl-2-related protein A1
Synonyms:
B2LA1_HUMAN BCL2L5 Bcl-2-like protein 5 HBPA1 Protein BFL-1 | Protein GRS
Type:
Apoptosis regulator protein
Mol. Mass.:
20130.01
Organism:
Homo sapiens (Human)
Description:
Residue:
175
  
Inhibitor
Name:
BDBM50316671
Synonyms:
(S)-1,(R)-1,1',6,6',7,7'-Hexahydroxy-3,3'-dimethyl-N5-((S)-2-phenylpropyl)-N5'-((S)-2-phenylpropyl)-2,2'-binaphthyl-5,5'-dicarboxamide
Type:
Small organic molecule
Emp. Form.:
C42H40N2O8
Mol. Mass.:
700.7756
SMILES:
C[C@H](CNC(=O)c1c(O)c(O)cc2c(O)c(c(C)cc12)-c1c(C)cc2c(C(=O)NC[C@@H](C)c3ccccc3)c(O)c(O)cc2c1O)c1ccccc1
: