Target
Melatonin receptor type 1B
Ligand
BDBM50316704
Substrate
Meas. Tech.
ChEMBL_632479 (CHEMBL1108343)
EC50
>10000±n/a nM
Citation
 Mésangeau, CPérès, BDescamps-François, CChavatte, PAudinot, VCoumailleau, SBoutin, JADelagrange, PBennejean, CRenard, PCaignard, DHBerthelot, PYous, S Design, synthesis and pharmacological evaluation of novel naphthalenic derivatives as selective MT(1) melatoninergic ligands. Bioorg Med Chem 18:3426-36 (2010)  
Target
Name:
Melatonin receptor type 1B
Synonyms:
MTNR1B Mel-1B-R Melatonin 1B Melatonin receptor type 1B | Melatonin receptor type 2 (MT2)
Type:
Enzyme
Mol. Mass.:
40203.54
Organism:
Homo sapiens (Human)
Description:
P49286
Residue:
362
  
Inhibitor
Name:
BDBM50316704
Synonyms:
CHEMBL1095522 | N-[2-(7-{4-[3-(2-Acetylaminoethyl)-1H-indol-5-yloxy]-butoxy}-naphthalen-1-yl)ethyl]acetamide
Type:
Small organic molecule
Emp. Form.:
C30H35N3O4
Mol. Mass.:
501.6166
SMILES:
CC(=O)NCCc1c[nH]c2ccc(OCCCCOc3ccc4cccc(CCNC(C)=O)c4c3)cc12
: