Target
Prolyl endopeptidase
Ligand
BDBM50279826
Substrate
Meas. Tech.
ChEMBL_632260 (CHEMBL1110122)
Ki
3±n/a nM
Citation
 Lawandi, JGerber-Lemaire, SJuillerat-Jeanneret, LMoitessier, N Inhibitors of prolyl oligopeptidases for the therapy of human diseases: defining diseases and inhibitors. J Med Chem 53:3423-38 (2010)  
Target
Name:
Prolyl endopeptidase
Synonyms:
PE Pep Prep
Type:
PROTEIN
Mol. Mass.:
80738.55
Organism:
Mus musculus
Description:
ChEMBL_1336164
Residue:
710
  
Inhibitor
Name:
BDBM50279826
Synonyms:
(1S,2S)-2-((S)-2-Formyl-pyrrolidine-1-carbonyl)-cyclohexanecarboxylic acid benzyl ester CHEMBL155614
Type:
Small organic molecule
Emp. Form.:
C20H25NO4
Mol. Mass.:
343.4168
SMILES:
O=C[C@@H]1CCCN1C(=O)[C@H]1CCCC[C@@H]1C(=O)OCc1ccccc1
: