Target
Prolyl endopeptidase
Ligand
BDBM50200729
Substrate
Meas. Tech.
ChEMBL_632270 (CHEMBL1110132)
Ki
2.2±n/a nM
Citation
 Lawandi, JGerber-Lemaire, SJuillerat-Jeanneret, LMoitessier, N Inhibitors of prolyl oligopeptidases for the therapy of human diseases: defining diseases and inhibitors. J Med Chem 53:3423-38 (2010)  
Target
Name:
Prolyl endopeptidase
Synonyms:
PE POP PREP Prolyl oligopeptidase
Type:
Enzyme
Mol. Mass.:
80688.50
Organism:
Homo sapiens (Human)
Description:
P48147
Residue:
710
  
Inhibitor
Name:
BDBM50200729
Synonyms:
(R)-1-(2-(2,5-dichlorobenzamido)acetyl)pyrrolidin-2-ylboronic acid | CHEMBL386890
Type:
Small organic molecule
Emp. Form.:
C13H15BCl2N2O4
Mol. Mass.:
344.986
SMILES:
OB(O)[C@@H]1CCCN1C(=O)CNC(=O)c1cc(Cl)ccc1Cl
: