Target
Androgen receptor
Ligand
BDBM50317651
Substrate
Meas. Tech.
ChEMBL_629229 (CHEMBL1121343)
IC50
3900±n/a nM
Citation
 Yoshino, HSato, HTachibana, KShiraishi, TNakamura, MOhta, MIshikura, NNagamuta, MOnuma, ENakagawa, TArai, SAhn, KHJung, KYKawata, H Structure-activity relationships of bioisosteric replacement of the carboxylic acid in novel androgen receptor pure antagonists. Bioorg Med Chem 18:3159-68 (2010)  
Target
Name:
Androgen receptor
Synonyms:
ANDR_HUMAN Androgen Receptor Androgen receptor/Baculoviral IAP repeat-containing protein 2 Dihydrotestosterone receptor Nuclear receptor subfamily 3 group C member 4
Type:
Receptor
Mol. Mass.:
99185.27
Organism:
Homo sapiens (Human)
Description:
CHO cells were stably transfected with human AR gene.
Residue:
920
  
Inhibitor
Name:
BDBM50317651
Synonyms:
4-[3-(4-cyano-3-trifluoromethylphenyl)-5,5-dimethyl-4-oxo-2-thioxoimidazolidin-1-yl]butyric acid | CHEMBL1099141
Type:
Small organic molecule
Emp. Form.:
C17H16F3N3O3S
Mol. Mass.:
399.387
SMILES:
CC1(C)N(CCCC(O)=O)C(=S)N(C1=O)c1ccc(C#N)c(c1)C(F)(F)F
: