Target
Farnesyl pyrophosphate synthase
Ligand
BDBM25308
Substrate
Meas. Tech.
ChEMBL_631176 (CHEMBL1109110)
IC50
3±n/a nM
Citation
 McKenna, CEKashemirov, BABlazewska, KMMallard-Favier, IStewart, CARojas, JLundy, MWEbetino, FHBaron, RADunford, JEKirsten, MLSeabra, MCBala, JLMarma, MSRogers, MJCoxon, FP Synthesis, chiral high performance liquid chromatographic resolution and enantiospecific activity of a potent new geranylgeranyl transferase inhibitor, 2-hydroxy-3-imidazo[1,2-a]pyridin-3-yl-2-phosphonopropionic acid. J Med Chem 53:3454-64 (2010)  
Target
Name:
Farnesyl pyrophosphate synthase
Synonyms:
Dimethylallyltranstransferase FPP synthase FPPS_HUMAN Farnesyl diphosphate synthase Farnesyl diphosphate synthetase Farnesyl pyrophosphate synthetase KIAA1293 | P14324
Type:
Enzyme
Mol. Mass.:
48272.89
Organism:
Homo sapiens (Human)
Description:
P14324
Residue:
419
  
Inhibitor
Name:
BDBM25308
Synonyms:
(1-hydroxy-2-{imidazo[1,2-a]pyridin-3-yl}-1-phosphonoethyl)phosphonic acid | bisphosphonate, 57
Type:
Small organic molecule
Emp. Form.:
C9H12N2O7P2
Mol. Mass.:
322.1483
SMILES:
OC(Cc1cnc2ccccn12)(P(O)(O)=O)P(O)(O)=O
: