Target
Glutamate receptor 2
Ligand
BDBM50318264
Substrate
Meas. Tech.
ChEMBL_629329 (CHEMBL1104009)
Ki
43.0±n/a nM
Citation
 Lolli, MLGiordano, CPickering, DSRolando, BHansen, KBFoti, AContreras-Sanz, AAmir, AFruttero, RGasco, ANielsen, BJohansen, TN 4-hydroxy-1,2,5-oxadiazol-3-yl moiety as bioisoster of the carboxy function. Synthesis, ionization constants, and molecular pharmacological characterization at ionotropic glutamate receptors of compounds related to glutamate and its homologues. J Med Chem 53:4110-8 (2010)  
Target
Name:
Glutamate receptor 2
Synonyms:
GRIA2_RAT Glutamate receptor AMPA 2/4 Gria2
Type:
PROTEIN
Mol. Mass.:
98691.74
Organism:
Rattus norvegicus
Description:
ChEMBL_936441
Residue:
883
  
Inhibitor
Name:
BDBM50318264
Synonyms:
(+)-2-Amino-3-(4-hydroxy-1,2,5-oxadiazol-3-yl)propionicAcid
Type:
Small organic molecule
Emp. Form.:
C5H7N3O4
Mol. Mass.:
173.1268
SMILES:
NC(Cc1no[nH]c1=O)C(O)=O
: