Target
Adenosine receptor A1
Ligand
BDBM21173
Substrate
Meas. Tech.
ChEMBL_629506 (CHEMBL1120795)
Ki
3.9±n/a nM
Citation
 Taliani, SLa Motta, CMugnaini, LSimorini, FSalerno, SMarini, AMDa Settimo, FCosconati, SCosimelli, BGreco, GLimongelli, VMarinelli, LNovellino, ECiampi, ODaniele, STrincavelli, MLMartini, C Novel N2-substituted pyrazolo[3,4-d]pyrimidine adenosine A3 receptor antagonists: inhibition of A3-mediated human glioblastoma cell proliferation. J Med Chem 53:3954-63 (2010)  
Target
Name:
Adenosine receptor A1
Synonyms:
A1 adenosine receptor (hA1) AA1R_HUMAN ADORA1 Adenosine A1-receptor Adenosine receptor A1 (hA1) | Adenosine transporter (AdT)
Type:
G Protein-Coupled Receptor (GPCR)
Mol. Mass.:
36520.92
Organism:
Homo sapiens (Human)
Description:
P30542
Residue:
326
  
Inhibitor
Name:
BDBM21173
Synonyms:
1,3-dipropyl-8-cyclopentylxanthine CHEMBL183 PD116948 | [3H]DPCPX
Type:
radiolabeled ligand
Emp. Form.:
C16H24N4O2
Mol. Mass.:
304.3874
SMILES:
CCCn1c2nc([nH]c2c(=O)n(CCC)c1=O)C1CCCC1
: