Target
Transient receptor potential cation channel subfamily A member 1
Ligand
BDBM50318493
Substrate
Meas. Tech.
ChEMBL_633024 (CHEMBL1118249)
EC50
800±n/a nM
Citation
 Baraldi, PGPreti, DMaterazzi, SGeppetti, P Transient receptor potential ankyrin 1 (TRPA1) channel as emerging target for novel analgesics and anti-inflammatory agents. J Med Chem 53:5085-107 (2010)  
Target
Name:
Transient receptor potential cation channel subfamily A member 1
Synonyms:
Anktm1 Trpa1
Type:
PROTEIN
Mol. Mass.:
128485.09
Organism:
Mus musculus
Description:
ChEMBL_1367709
Residue:
1125
  
Inhibitor
Name:
BDBM50318493
Synonyms:
3-isopropyl 5-(2-methoxyethyl) 2,6-dimethyl-4-(3-nitrophenyl)-1,4-dihydropyridine-3,5-dicarboxylate CHEMBL1428 Nimotop
Type:
Small organic molecule
Emp. Form.:
C21H26N2O7
Mol. Mass.:
418.4403
SMILES:
COCCOC(=O)C1=C(C)N=C(C)C(C1c1cccc(c1)[N+]([O-])=O)C(=O)OC(C)C
: