Target
WD repeat-containing protein 5
Ligand
BDBM50318543
Substrate
Meas. Tech.
ChEMBL_633068 (CHEMBL1118768)
Ki
6300±n/a nM
Citation
 Karatas, HTownsend, ECBernard, DDou, YWang, S Analysis of the binding of mixed lineage leukemia 1 (MLL1) and histone 3 peptides to WD repeat domain 5 (WDR5) for the design of inhibitors of the MLL1-WDR5 interaction. J Med Chem 53:5179-85 (2010)  
Target
Name:
WD repeat-containing protein 5
Synonyms:
BIG3 WD repeat-containing protein 5 (WDR5) WDR5 | WDR5_HUMAN
Type:
Protein
Mol. Mass.:
36597.13
Organism:
Homo sapiens (Human)
Description:
P61964
Residue:
334
  
Inhibitor
Name:
BDBM50318543
Synonyms:
Ac-RAEVHLRKS-NH2 | CHEMBL1086452
Type:
Small organic molecule
Emp. Form.:
C48H85N19O13
Mol. Mass.:
1136.308
SMILES:
CC(C)C[C@H](NC(=O)[C@H](Cc1cnc[nH]1)NC(=O)[C@@H](NC(=O)[C@H](CCC(O)=O)NC(=O)[C@H](C)NC(=O)[C@H](CCCN=C(N)N)NC(C)=O)C(C)C)C(=O)N[C@@H](CCCN=C(N)N)C(=O)N[C@@H](CCCCN)C(=O)N[C@@H](CO)C(N)=O
: