Target
Poly [ADP-ribose] polymerase tankyrase-2
Ligand
BDBM50318567
Substrate
Meas. Tech.
ChEMBL_633153 (CHEMBL1119037)
Kd
14±n/a nM
Citation
 Karlberg, TMarkova, NJohansson, IHammarström, MSchütz, PWeigelt, JSchüler, H Structural basis for the interaction between tankyrase-2 and a potent Wnt-signaling inhibitor. J Med Chem 53:5352-5 (2010)  
Target
Name:
Poly [ADP-ribose] polymerase tankyrase-2
Synonyms:
(ARTD6 or PARP5b) Poly [ADP-ribose] polymerase tankyrase-2 TNKL TNKS2_HUMAN Tankyrase 2 Tankyrase-2 Tankyrase-2 (TNKS2)
Type:
Enzyme
Mol. Mass.:
126937.16
Organism:
Homo sapiens (Human)
Description:
Q9H2K2
Residue:
1166
  
Inhibitor
Name:
BDBM50318567
Synonyms:
2-(4-(Trifluoromethyl)phenyl)-7,8-dihydro-5H-thiopyrano-[4,3-d]pyrimidin-4-ol CHEMBL1086580
Type:
Small organic molecule
Emp. Form.:
C14H11F3N2OS
Mol. Mass.:
312.31
SMILES:
FC(F)(F)c1ccc(cc1)-c1nc2CCSCc2c(=O)[nH]1
: